Make fails with 2.3.0 on Mac OS X 10.7.5

Previous Topic Next Topic
 
classic Classic list List threaded Threaded
1 message Options
Reply | Threaded
Open this post in threaded view
|

Make fails with 2.3.0 on Mac OS X 10.7.5

James Brown
Compile is failing for me.

./configure --with-mysql --with-ssl=openssl:

...
checking for SSL_read in -lssl... yes
checking openssl/ssl.h usability... yes
checking openssl/ssl.h presence... yes
checking for openssl/ssl.h... yes
checking openssl/err.h usability... yes
checking openssl/err.h presence... yes
checking for openssl/err.h... yes
checking if OpenSSL version is 1.0.1 or newer... true
checking if OpenSSL version is 1.0.2 or better... true
checking whether SSL_clear_options exists... no
...

No problems. But then ‘make’ ends with:

dcrypt-openssl.c:117: error: field 'ctx' has incomplete type
dcrypt-openssl.c: In function 'dcrypt_openssl_ctx_hmac_destroy':
dcrypt-openssl.c:451: warning: implicit declaration of function 'HMAC_cleanup'
dcrypt-openssl.c: In function 'dcrypt_openssl_generate_ec_key':
dcrypt-openssl.c:555: error: dereferencing pointer to incomplete type
dcrypt-openssl.c:556: error: dereferencing pointer to incomplete type
dcrypt-openssl.c: In function 'dcrypt_openssl_ecdh_derive_secret_local':
dcrypt-openssl.c:588: error: dereferencing pointer to incomplete type
dcrypt-openssl.c: In function 'dcrypt_openssl_ecdh_derive_secret_peer':
dcrypt-openssl.c:668: error: dereferencing pointer to incomplete type
dcrypt-openssl.c:697: error: dereferencing pointer to incomplete type
dcrypt-openssl.c:698: error: dereferencing pointer to incomplete type
dcrypt-openssl.c: In function 'dcrypt_openssl_store_private_key_dovecot':
dcrypt-openssl.c:1461: error: dereferencing pointer to incomplete type
dcrypt-openssl.c:1482: error: dereferencing pointer to incomplete type
dcrypt-openssl.c:1489: error: dereferencing pointer to incomplete type
dcrypt-openssl.c: In function 'dcrypt_openssl_load_private_key':
dcrypt-openssl.c:1615: error: dereferencing pointer to incomplete type
dcrypt-openssl.c: In function 'dcrypt_openssl_store_public_key':
dcrypt-openssl.c:1765: error: dereferencing pointer to incomplete type
dcrypt-openssl.c: In function 'dcrypt_openssl_private_to_public_key':
dcrypt-openssl.c:1801: error: dereferencing pointer to incomplete type
dcrypt-openssl.c: In function 'dcrypt_openssl_name2oid':
dcrypt-openssl.c:2062: error: dereferencing pointer to incomplete type
dcrypt-openssl.c: In function 'dcrypt_openssl_public_key_id_old':
dcrypt-openssl.c:2112: error: dereferencing pointer to incomplete type
dcrypt-openssl.c: In function 'dcrypt_openssl_private_key_id_old':
dcrypt-openssl.c:2135: error: dereferencing pointer to incomplete type
dcrypt-openssl.c: In function 'dcrypt_openssl_public_key_id_evp':
dcrypt-openssl.c:2153: error: dereferencing pointer to incomplete type
make[3]: *** [libdcrypt_openssl_la-dcrypt-openssl.lo] Error 1
make[2]: *** [all-recursive] Error 1
make[1]: *** [all-recursive] Error 1
make: *** [all] Error 2

Any suggestions?

Thanks,

James.